Home > Cannot Run > Cannot Run Program Preverify

Cannot Run Program Preverify

Comment 8 Alexandr Scherbatiy 2008-11-01 15:15:49 UTC verified in the promoted build #63 31-Oct-2008 11:41:07 Format For Printing -XML -Clone This Bug -Top of page First Last Prev Next This C:\Program Files\Eclipse\plugins\net.rim.eide.componentpack4.5.0_4.5.0.16\components\bin\launcher.exe C:\Program Files\Eclipse\plugins\net.rim.eide.componentpack4.5.0_4.5.0.16\components\bin\rapc.exe -quiet import="..\..\..\..\..\Program Files\Eclipse\plugins\net.rim.eide.componentpack4.5.0_4.5.0.16\components\lib\net_rim_api.jar" codename=..\[Project1]\[Project1] ..\[Project1]\[Project1].rapc warnkey=0x52435200 -sourceroot="C:\[...]\Workspace\[Project1]\src" @[Project1]_build.files I/O Error: Cannot run program "jar": CreateProcess error=2, The system cannot find the file specified rapc executed for the Join them; it only takes a minute: Sign up Fatal error : unable to launch target VM up vote 2 down vote favorite 2 I am new to the java and As a workaround, I copied the failed command (display in the packaging console window) into a command prompt from the project's directory and it worked fine. navigate here

I didn't actually install the jdk ! Stu Thanks Stu, that worked! asked 3 years ago viewed 741 times active 3 years ago Upcoming Events 2016 Community Moderator Election ends Nov 22 Related 3What is the default properties that eclipse uses to launch javac -g Foo.java compiled properly . http://winbytes.org/help/cannot-run/cannot-run-program-preverify-exe-createprocess-error-2.html

When does “haben” push “nicht” to the end of the sentence? Did a thief think he could conceal his identity from security cameras by putting lemon juice on his face? Add Thread to del.icio.us Bookmark in Technorati Tweet this thread Sign In Create Account Search among 990,000 solutions Search Your bugs help others We want to create amazing apps without being

I do not think so. Thanks everyone! Is it anti-pattern if a class property creates and returns a new instance of a class? Stu Offline 05-11-2010, 01:10 AM #4 (permalink) Taurus084 New Member Join Date: May 2010 Model: B9700 PIN: N/A Carrier: AT&T Posts: 1 Post Thanks: 0 Thanked 0 Times

Can variation ratio ever be 0? There should still remain the "Java(TM) Platform Micro Edition SDK 3.0". I didn't actually install the jdk ! you can try this out Anyway, once I installed the jdk I still wasn't quite there.

The issue is not reproduced now but it reproduced in the previous promoted build. Can Sombra teleport to her teleporter after respawn? It will be set after the class is loaded. > run main run main java.io.IOException: Cannot run program "C:\Program": CreateProcess error=2, The system cannot find the file specified at java.lang.ProcessBuilder.start(ProcessBuilder.java:470) at BUILD FAILED (total time: 8 seconds)Solved with bin32 jdk.

Cheers everyone Offline #3 2009-03-17 03:14:15 scottuss Member From: England Registered: 2009-02-20 Posts: 77 Re: J2ME Arch64 and Netbeans BUMP. Anyway, once I installed the jdk I still wasn't quite there. Notice that the second project uses imports, while the first one doesn't. The JDK needed to be installed...

Comment 7 Lark Fitzgerald 2008-10-31 17:37:54 UTC Should be marked WORKSFORME. http://optimisersonpc.com/cannot-run/cannot-run-program-svnversion-exe.html Just go to Tools / Java Platforms and remove the WTK 2.5.2 platform. Back to top Display posts from previous: All Posts1 Day7 Days2 Weeks1 Month3 Months6 Months1 YearOldest FirstNewest First NetBeans Forums -> Java ME Users All times are GMT Page 1 Offline Pages: 1 Index »Programming & Scripting »J2ME Arch64 and Netbeans Board footer Jump to Newbie Corner Installation Kernel & Hardware Applications & Desktop Environments Laptop Issues Networking, Server, and Protection

  1. Sometimes you'll receive file not found errors on 64 bit when trying to run a self contained 32 bit binary.
  2. Please assign a very high priority issue on SDK RE about random regressions during the integration process, I am unable to track this mess as there is even no changelog.
  3. It's for an assignment at University.

What's going on if the problem is just happening with some, but not all, of my projects? I don't know how to go over it :? Locker Service: How to get the event target? http://optimisersonpc.com/cannot-run/eclipse-cannot-run-program-sh.html Developer does not see priority in git Development Workflow being followed Build me a Brick Wall!

Dne 2.4.2011 9:09, keno2 napsal(a): Quote: Hi all. Hey Guys, I was having this issue...feel like an idiot now. I had to edit my Windows Environment PATH variable to have the path to the jdk bin directory.

Do humans have an ethical obligation to prevent animal on animal violence?

Adam? Accept & Close current community chat Stack Overflow Meta Stack Overflow your communities Sign up or log in to customize your list. The names RIM and BlackBerry are registered Trademarks of BlackBerry Inc. Two-headed version of \Rightarrow or \implies Mimsy were the Borogoves - why is "mimsy" an adjective?

Starting emulator in execution mode java.lang.UnsatisfiedLinkError: /opt/WTK2.5.2/bin/sublime.so: /opt/WTK2.5.2/bin/sublime.so: wrong ELF class: ELFCLASS32 (Possible cause: architecture word width mismatch) at java.lang.ClassLoader$NativeLibrary.load(Native Method) at java.lang.ClassLoader.loadLibrary0(ClassLoader.java:1803) at java.lang.ClassLoader.loadLibrary(ClassLoader.java:1699) at java.lang.Runtime.load0(Runtime.java:770) at java.lang.System.load(System.java:1003) at com.sun.kvem.Sublime.(Unknown Steps to reproduce: - Create a JavaFX Script project ------------------------------------------------ import javafx.stage.Stage; import javafx.scene.Scene; import javafx.scene.text.Text; Stage{ title: "Application title" width: 250 height: 80 scene: Scene{ content: Text { x: 10, You can try to reinstall NetBeans or download and install just the WTK standalone and set it up in the Java Platform Manager inside Netbeans. weblink My PATH=%SystemRoot%\system32;%SystemRoot%;%SystemRoot%\System32\Wbem;%SYSTEMROOT%\System32\WindowsPowerShell\v1.0\;C:\cygwin\;C:\Users\test\Downloads\adt-bundle-windows-x86-20130219\adt-bundle-windows-x86-20130219\sdk\platform-tools\;"C:\Program Files\Java\jre1.6.0_16\bin";"C:\Program Files\Java\jre6\bin";"C:\Program Files\Java\jdk1.6.0_45\bin";C:\Users\test\Downloads\adt-bundle-windows-x86-20130219\adt-bundle-windows-x86-20130219\sdk\tools;"C:\Program Files\Graphviz2.26.3\bin";"C:\Program Files\Graphviz2.26.3\bin" C:\Users\test\workspace\sampleJava>java -version java version "1.6.0_45" Java(TM) SE Runtime Environment (build 1.6.0_45-b06) Java HotSpot(TM) Client VM (build 20.45-b01, mixed mode, sharing) C:\Users\test\workspace\sampleJava>javac -version javac 1.6.0_45

I tried the wma demo in netbeans 6.9.1 with linux ubuntu 10.04 but i get this error: Preverifying 11 file(s) into /home/ko/NetBeansProjects/WMADemo1/build/preverified directory. /home/ko/NetBeansProjects/WMADemo1/nbproject/build-impl.xml:470: java.io.IOException: Cannot run program "/home/ko/netbeans-6.9.1/mobility/WTK2.5.2/bin/preverify": java.io.IOException: error=2, Also, I don't think my problem is related to the BlackBerry Preferences as a whole messing up, because I have many projects and only some of them are getting this error, Sponsored by NetBeans IDE NetBeans Platform Plugins Docs & Support Community Partners HOME / NetBeans forums NetBeans Forums FAQ Search Memberlist Register Profile Log in to check your private messages Log Surprisingly I got as far as building and testing the RIM Samples and my own application with no problem.

GO OUT AND VOTE Why do the cars die after removing jumper cables How to decline a postdoc interview if there is some possible future collaboration? Also, how do I modify a PATH variable as described? It wasn't until I went to test using a project that depends on another project. All I see in the Installed Components tree item of the BlackBerry Preferences window is "Choose one of installed Components", nothing about Java Home.

It wasn't until I went to test using a project that depends on another project. In my case it was: C:\Program Files\Java\jdk1.6.0_20\bin Save the variable change. Tried to run program using command >java Foo Got the output . Automated exception search integrated into your IDE Test Samebug Integration for IntelliJ IDEA 0 mark TestNG from Eclipse fails with default JBoss Tools Project.

Surprisingly I got as far as building and testing the RIM Samples and my own application with no problem. Browse other questions tagged jdb or ask your own question. Automated exception search integrated into your IDE Test Samebug Integration for IntelliJ IDEA Root Cause Analysis java.io.IOException CreateProcess error=2, ϵͳÕҲ»µ½ָ¶ at java.lang.ProcessImpl.create() Java RT Runtime.exec java.lang.ProcessImpl.create(Native Method) java.lang.ProcessImpl.(ProcessImpl.java:81) java.lang.ProcessImpl.start(ProcessImpl.java:30) java.lang.ProcessBuilder.start(ProcessBuilder.java:452) java.lang.Runtime.exec(Runtime.java:593) Is there any path setting i need to set for jdb . (I was trying to follow this tutorial) I think i am missing a very basic thing.

In my case it was: C:\Program Files\Java\jdk1.6.0_20\bin Save the variable change. This site uses cookies, as explained in our cookie policy. I'm guessing at this point Eclipse needed "jar" to put together the compiled code from the separate projects.

Back to Top